3,6-Dihydroxy-9,9-dimethylfluorene

Normal alkane RI, non-polar column, temperature ramp

View large format table.

Column type Active phase I Reference Comment
CapillaryHP-5 MS2239.Bozi, Czagany, et al., 200730. m/0.25 mm/0.25 μm, Helium, 50. C @ 1. min, 10. K/min, 300. C @ 4. min

References

Bozi, Czagany, et al., 2007
Bozi, J.; Czagany, Z.; Meszaros, E.; Blazso, M., Thermal decomposition of flame retarded polycarbonates, J. Anal. Appl. Pyrolysis, 2007, 79, 1-2, 337-345, https://doi.org/10.1016/j.jaap.2007.01.001 . [all data]