Avenaciolide, 6-[2-(3-bromophenyl)ethyl]

Normal alkane RI, non-polar column, custom temperature program

View large format table.

Column type Active phase I Reference Comment
CapillaryDB-11824.Alves, Rubinger, et al., 2006Program: not specified

References

Alves, Rubinger, et al., 2006
Alves, L.C.; Rubinger, M.M.M.; Jham, G.N.; Castelo-Branco, P.A.; Pilo-Veloso, D., Caracterização por Cromatografia Gasosa e Espectrometria de Massas de Bis-γ-lactonas com atividade fungicida, 29a Reunião Anual da Sociedade Brasileira de Química, 2006, retrieved from https://sec.sbq.org.br/cd29ra/listaresumo.htm, https://sec.sbq.org.br/cd29ra/resumos/T1917-1.pdf. [all data]