16,17-dihydro-GA34, Me-TMS

Normal alkane RI, non-polar column, temperature ramp

View large format table.

Column type Active phase I Reference Comment
CapillaryDB-52767.Park, Nakajima, et al., 200515. m/0.25 mm/0.25 μm, Helium, 60. C @ 2. min, 15. K/min; Tend: 300. C

References

Park, Nakajima, et al., 2005
Park, S.-H.; Nakajima, M.; Sakane, M.; Xu, Z.-J.; Tomioka, K.; Yamaguchi, I., Gibberellin 2-oxidases from seedings of Adzuki bean (Vigna angularis) show high gibberellin-binding activity in the presence os 2-oxoglutarate and Co2+, Biosci. Biotechnol. Biochem., 2005, 69, 8, 1498-1507, https://doi.org/10.1271/bbb.69.1498 . [all data]