Glycerol, 2,3-dimethyl, 1-heptadecanoate

Kovats' RI, non-polar column, temperature ramp

View large format table.

Column type Active phase I Reference Comment
CapillaryOV-1012371.Knorr and Spiteller, 1990H2, 3. K/min; Column length: 30. m; Column diameter: 0.30 mm; Tstart: 100. C; Tend: 280. C

References

Knorr and Spiteller, 1990
Knorr, W.; Spiteller, G., Simple method for the analysis of glycerol enol ethers derived from plasmalogens in complex lipid mixtures and subsequent determination of the aldehydic components by gas chromatography-mass spectrometry., J. Chromatogr., 1990, 526, 303-318, https://doi.org/10.1016/S0378-4347(00)82515-3 . [all data]