2-Phenylglycine, ethoxycarbonylated, TBDMS

Normal alkane RI, non-polar column, temperature ramp

View large format table.

Column type Active phase I Reference Comment
CapillaryDB-52022.Paik, Lee, et al., 200530. m/0.25 mm/0.25 μm, Helium, 60. C @ 2. min, 4. K/min; Tend: 290. C

References

Paik, Lee, et al., 2005
Paik, M.-J.; Lee, H.-J.; Kim, K.-R., Simultaneous retention index analysis of urinary amino acids and carboxylic acids for graphic recognition of abnormal state, J. Chromatogr. B, 2005, 821, 1, 94-104, https://doi.org/10.1016/j.jchromb.2005.04.011 . [all data]