C33 17A,21B,22R-Hopane

Normal alkane RI, non-polar column, temperature ramp

Data compiled by: NIST Mass Spectrometry Data Center, William E. Wallace, director

Column type Capillary
Active phase DB-1
Column length (m) 15.
Carrier gas He
Substrate
Column diameter (mm) 0.25
Phase thickness (μm) 1.0
Tstart (C) 50.
Tend (C) 300.
Heat rate (K/min) 4.
Initial hold (min)
Final hold (min)
I 3429.
ReferenceHwang, 1990
Comment MSDC-RI

References

Hwang, 1990
Hwang, R.J., Biomarker Analysis Using GC-MSD, J. Chromatogr. Sci., 1990, 28, 3, 109-113, https://doi.org/10.1093/chromsci/28.3.109 . [all data]