p-Mentha-1,4-dien-9-al

Normal alkane RI, polar column, temperature ramp

Data compiled by: NIST Mass Spectrometry Data Center, William E. Wallace, director

Column type Capillary
Active phase Carbowax 20M
Column length (m) 25.
Carrier gas H2
Substrate
Column diameter (mm) 0.53
Phase thickness (μm) 2.0
Tstart (C) 40.
Tend (C) 210.
Heat rate (K/min) 5.
Initial hold (min) 3.
Final hold (min) 10.
I 1653.
ReferenceKrings, Brauer, et al., 2005
Comment MSDC-RI

References

Krings, Brauer, et al., 2005
Krings, U.; Brauer, B.; Kaspera, R.; Berger, R.G., Biotransformation of gamma-terpinene using Stemphylium botryosum (Wallroth) yields p-mentha-1,4-dien-9-ol, a novel odorous monoterpenol, Biocatal. Biotransform., 2005, 23, 6, 457-463, https://doi.org/10.1080/10242420500444267 . [all data]