3-Ethyl-2-isopropyl-3,5-dimethyl-1,4,2-diazaphosphorine-2-oxide

Normal alkane RI, non-polar column, custom temperature program

View large format table.

Column type Active phase I Reference Comment
CapillaryOV-11835.Fagadar-Cosma, Fagadar-Cosma, et al., 2005Program: not specified

References

Fagadar-Cosma, Fagadar-Cosma, et al., 2005
Fagadar-Cosma, E.; Fagadar-Cosma, G.; Laichici, M., Synthesis and auxinic behavior of 3-ethyl-2-isopropyl-3,5-dimethyl-1,4,2-diazaphosphorine-2-oxide, Acta Chim. Slov., 2005, 52, 93-97. [all data]