ent-(+)-(1R,6R,7S,10S)-Amorpha-4,11-diene

Normal alkane RI, non-polar column, temperature ramp

Data compiled by: NIST Mass Spectrometry Data Center, William E. Wallace, director

Column type Capillary
Active phase CP Sil 5 CB
Column length (m) 25.
Carrier gas H2
Substrate
Column diameter (mm)
Phase thickness (μm)
Tstart (C) 50.
Tend (C) 230.
Heat rate (K/min) 3.
Initial hold (min)
Final hold (min)
I 1480.
ReferenceAdio, 2005
Comment MSDC-RI

References

Adio, 2005
Adio, A.M., Isolation and structure elucidation of sesquiterpenoids from the essential oils of some liverworths (Hepaticae), Dissertation, Hamburg University, 2005, 265. [all data]