ent-6α,7α-Dihydroxy trachylobanic acid, Me-TMS

Normal alkane RI, non-polar column, custom temperature program

View large format table.

Column type Active phase I Reference Comment
Capillary5 % Phenyl methyl siloxane2531.Davidson, Elliott, et al., 2003Program: not specified

References

Davidson, Elliott, et al., 2003
Davidson, S.E.; Elliott, R.C.; Helliwell, C.A.; Poole, A.T.; Reid, J.B., The PEa gene NA encodes ent-Kaurenoic acid oxidase, Plant Physiol., 2003, 131, 1, 335-344, https://doi.org/10.1104/pp.012963 . [all data]