Benzofuran-2,3-dione, 2-[O-(2-hydroxyethyl)oxime], 3-(O-methyloxime), TMS, isomer 2

Normal alkane RI, non-polar column, custom temperature program

View large format table.

Column type Active phase I Reference Comment
CapillaryPolydimethyl siloxane2053.Gayer, Gallenkamp, et al., 2002Program: not specified
CapillaryPolydimethyl siloxane2062.Gayer, Gallenkamp, et al., 2002Program: not specified
CapillaryPolydimethyl siloxane1997.Gayer, Gallenkamp, et al., 2002Program: not specified
CapillaryPolydimethyl siloxane2000.Gayer, Gallenkamp, et al., 2002Program: not specified

References

Gayer, Gallenkamp, et al., 2002
Gayer, H.; Gallenkamp, B.; Garder, P.; Heinemann, U.; Kruger, B.-U.; LAntzsch, R.; Seitz, T.; Stelzer, U., Process for preparing 3-(1-hydroxyphenyl-1-alkoximinomethyl)dioxazines, 2002, 38, retrieved from http://www.patentstorm.us/patents/6730799/description/html. [all data]