Tetrahydrocortisone, MO-tris-TMS

Normal alkane RI, non-polar column, custom temperature program

Data compiled by: NIST Mass Spectrometry Data Center, William E. Wallace, director

Column type Capillary
Active phase HP-1
Column length (m) 17.
Carrier gas Helium
Substrate
Column diameter (mm) 0.20
Phase thickness (μm) 0.11
Program 180 0C 3 0C/min -> 229 0C 40 0C/min -> 310 0C (5 min)
I 2666.
ReferencePereira, Marques, et al., 2001
Comment MSDC-RI

References

Pereira, Marques, et al., 2001
Pereira, H.M.G.; Marques, M.A.S.; Cardoso, J.N.; Neto, F.R.A., Derivatization study of endogenous and synthetic corticosteroids by gas chromatography mass spectrometry in Recent Advances in Doping Analysis, Schanzer, W.; Geyer, H.; Gotzmann, A.; Mareck-Engelke, U., ed(s)., Sport und Buch Strauss, Koln, 2001, 203-207. [all data]