Thiazoline

Normal alkane RI, non-polar column, custom temperature program

Data compiled by: NIST Mass Spectrometry Data Center, William E. Wallace, director

Column type Capillary
Active phase DB-5
Column length (m) 60.
Carrier gas Helium
Substrate
Column diameter (mm) 0.25
Phase thickness (μm) 0.25
Program 35 0C (2 min) 30 0C/min -> 60 0C (1 min) 6 0C/min -> 250 0C (10 min)
I 819.
ReferenceDidzbalis and Ho, 2001
Comment MSDC-RI

References

Didzbalis and Ho, 2001
Didzbalis, J.; Ho, C.-T., Analysis of low molecular weight aldehydes formed during the Mallard reaction, ACS Symposium Series, 2001, 794, 196-107. [all data]