(Z)-9-(E)-12-Tetradecadienal

Normal alkane RI, non-polar column, custom temperature program

View large format table.

Column type Active phase I Reference Comment
CapillaryHP-11582.Wakamura, Hattori, et al., 199915. m/0.25 mm/0.25 μm, He; Program: 50 0C (1 min) 20 0C/min -> 100 0C 5 0C/min -> 230 0C (5 min)

Normal alkane RI, polar column, custom temperature program

View large format table.

Column type Active phase I Reference Comment
CapillaryDB-Wax2053.Wakamura, Hattori, et al., 199930. m/0.25 mm/0.25 μm, He; Program: 50 0C (1 min) 20 0C/min -> 100 0C 5 0C/min -> 230 0C (5 min)

References

Wakamura, Hattori, et al., 1999
Wakamura, S.; Hattori, M.; Igita, K.; Yasuda, K.; Tridjaka, Sex pheromone of Etiella behrii, a pod borer of soybean in Indonesia: identification and field attraction, Entomol. Exp. Appl., 1999, 91, 3, 413-420, https://doi.org/10.1046/j.1570-7458.1999.00509.x . [all data]