Methyl glucuronide, TMS

Normal alkane RI, non-polar column, temperature ramp

View large format table.

Column type Active phase I Reference Comment
CapillaryUltra 11983.Sticht and Käferstein, 199912. m/0.20 mm/0.33 μm, He, 10. K/min

References

Sticht and Käferstein, 1999
Sticht, G.; Käferstein, H., Chemische Synthese und gaschromatographischer Nachweis von Alkylglucuroniden, Rechtsmedizin, 1999, 9, 5, 184-189, https://doi.org/10.1007/s001940050106 . [all data]