Isopropyl glucuronide, TMS

Normal alkane RI, non-polar column, temperature ramp

Data compiled by: NIST Mass Spectrometry Data Center, William E. Wallace, director

Column type Capillary
Active phase Ultra 1
Column length (m) 12.
Carrier gas He
Substrate
Column diameter (mm) 0.20
Phase thickness (μm) 0.33
Tstart (C)
Tend (C)
Heat rate (K/min) 10.
Initial hold (min)
Final hold (min)
I 2033.
ReferenceSticht and Käferstein, 1999
Comment MSDC-RI

References

Sticht and Käferstein, 1999
Sticht, G.; Käferstein, H., Chemische Synthese und gaschromatographischer Nachweis von Alkylglucuroniden, Rechtsmedizin, 1999, 9, 5, 184-189, https://doi.org/10.1007/s001940050106 . [all data]