C33-25-Norhopane, 17aH, 21bH, 22S

Normal alkane RI, non-polar column, temperature ramp

View large format table.

Column type Active phase I Reference Comment
CapillaryDB-53301.Nascimento, Reboucas, et al., 199930. m/0.25 mm/0.25 μm, He, 100. C @ 0.89 min, 2.5 K/min, 320. C @ 30. min

References

Nascimento, Reboucas, et al., 1999
Nascimento, L.R.; Reboucas, L.M.C.; Koike, L.; Reis, F.A.M.; Soldan, A.L.; Cerqueira, J.R.; Marsaioli, A.J., Acidic biomarkers from Albacora oils, Campos Basin, Brazil, Org. Geochem., 1999, 30, 9, 1175-1191, https://doi.org/10.1016/S0146-6380(99)00107-2 . [all data]