24-epi-Castasterone

Normal alkane RI, non-polar column, temperature ramp

View large format table.

Column type Active phase I Reference Comment
CapillaryDB-5 MS3660.Franke, Kuhnt, et al., 199915. m/0.32 mm/0.25 μm, Helium, 170. C @ 1. min, 30. K/min, 290. C @ 20. min
CapillaryDB-5 MS3662.Franke, Kuhnt, et al., 199915. m/0.32 mm/0.25 μm, Helium, 170. C @ 1. min, 30. K/min, 290. C @ 20. min

References

Franke, Kuhnt, et al., 1999
Franke, K.; Kuhnt, C.; Schmidt, J.; Munoz, O., 24-Epi-castasterone and phytosterols from seeds of Maytenus boaria (Celastraceae), Rev. Latinoamer. Quim., 1999, 27, 3, 111-115. [all data]