5A-Estran-3B,17B-diol, 17A-ethyl

Kovats' RI, non-polar column, isothermal

Data compiled by: NIST Mass Spectrometry Data Center, William E. Wallace, director

Column type Packed
Active phase OV-1
Column length (m)
Carrier gas
Substrate
Column diameter (mm)
Phase thickness (μm)
Temperature (C) 210.
I 2520.
ReferenceBrooks, Thawley, et al., 1971
Comment MSDC-RI

References

Brooks, Thawley, et al., 1971
Brooks, C.J.W.; Thawley, A.R.; Rocher, P.; Middleditch, B.S.; Anthony, G.M.; Stillwell, W.G., Characterization of Steroidal Drug Metabolites by Combined Gas Chromatography-Mass Spectrometry, J. Chromatogr. Sci., 1971, 9, 1, 35-43, https://doi.org/10.1093/chromsci/9.1.35 . [all data]