Methylphosphonic acid, methyl-(2-pentyl) ester

Normal alkane RI, non-polar column, temperature ramp

View large format table.

Column type Active phase I Reference Comment
CapillaryHP-5 MS716.Sokolowski, 199930. m/0.25 mm/0.25 μm, Helium, 40. C @ 2. min, 10. K/min; Tend: 270. C
CapillaryDB-5MS716.Szymanska, Sokolowski, et al., 199630. m/0.25 mm/0.25 μm, He, 40. C @ 2. min, 10. K/min; Tend: 270. C

References

Sokolowski, 1999
Sokolowski, M., MAss spectra and retention parameters of some O-alkyl methylphosphonic acids, Analytical chemistry associated with the destruction of chemical weapons, 1999, 13, 99-104. [all data]

Szymanska, Sokolowski, et al., 1996
Szymanska, A.; Sokolowski, M.; Sliwakowski, M., Mass spectra and retention indices of selected O-alkyl hydrogen methylphosphonates, Biul. Inform. WIChiR 1/26/96, 1996, 1, 26, 53-59. [all data]