1-Methoxy-2,20-dimethyltricosane

Normal alkane RI, non-polar column, custom temperature program

Data compiled by: NIST Mass Spectrometry Data Center, William E. Wallace, director

Column type Capillary
Active phase RTX-5
Column length (m) 30.
Carrier gas Hydrogen
Substrate
Column diameter (mm) 0.25
Phase thickness (μm) 0.25
Program 60 0C 50 0C/min -> 150 0C 3 0C/min -> 300 0C
I 2625.
ReferenceSchulz and Toft, 1993
Comment MSDC-RI

References

Schulz and Toft, 1993
Schulz, S.; Toft, S., Branched long chain alkyl methyl ethers: a new class of lipids from spider silk, Tetrahedron, 1993, 49, 31, 6805-6820, https://doi.org/10.1016/S0040-4020(01)80424-5 . [all data]