(E)-1,3-Tridecadiene-5,7,9,11-tetrayne

Normal alkane RI, polar column, temperature ramp

Data compiled by: NIST Mass Spectrometry Data Center, William E. Wallace, director

Column type Capillary
Active phase DB-Wax
Column length (m) 60.
Carrier gas
Substrate
Column diameter (mm) 0.32
Phase thickness (μm)
Tstart (C) 50.
Tend (C) 230.
Heat rate (K/min) 4.
Initial hold (min)
Final hold (min) 10.
I 2277.
ReferenceBinder, Turner, et al., 1990
Comment MSDC-RI

References

Binder, Turner, et al., 1990
Binder, R.G.; Turner, C.E.; Flath, R.A., Comparison of yellow starthistle volatiles from different plant parts, J. Agric. Food Chem., 1990, 38, 3, 764-767, https://doi.org/10.1021/jf00093a038 . [all data]