1H-Inden-3-ol, 2,3,3a,4,5,6-hexahydro-2,2-dimethyl-5-methylene-7-hydroxymethyl

Normal alkane RI, non-polar column, isothermal

View large format table.

Column type Active phase Temperature (C) I Reference Comment
CapillaryDB-1170.1849.Stránsky, Semerdzieva, et al., 199230. m/0.25 mm/0.25 μm, H2

Normal alkane RI, polar column, isothermal

View large format table.

Column type Active phase Temperature (C) I Reference Comment
CapillaryDB-Wax230.3118.Stránsky, Semerdzieva, et al., 199230. m/0.25 mm/0.25 μm, H2

References

Stránsky, Semerdzieva, et al., 1992
Stránsky, K.; Semerdzieva, M.; Otmar, M.; Procházka, Z.; Budesínsky, M.; Ubik, K.; Kohoutová, J.; Streinz, L., Antifungal antibiotic from the mushroom. Agrocybe aegerita (Brig.) Sing., Collect. Czech. Chem. Commun., 1992, 57, 3, 590-603, https://doi.org/10.1135/cccc19920590 . [all data]