Carene, 3,4-epoxide

Normal alkane RI, polar column, temperature ramp

Data compiled by: NIST Mass Spectrometry Data Center, William E. Wallace, director

Column type Capillary
Active phase Carbowax 20M
Column length (m) 45.
Carrier gas Hydrogen
Substrate
Column diameter (mm) 0.32
Phase thickness (μm) 1.0
Tstart (C) 60.
Tend (C) 200.
Heat rate (K/min) 2.
Initial hold (min) 5.
Final hold (min)
I 1438.
ReferenceKollmannsberger, Nitz, et al., 1992
Comment MSDC-RI

References

Kollmannsberger, Nitz, et al., 1992
Kollmannsberger, H.; Nitz, S.; Drawert, F., UBer die Aromastoffzusammensetzung von Hochdruckextrakten. I. Pfeffer (Piper nigrum, Var. muntok), Z. Lebensm. Unters Forsch., 1992, 194, 6, 545-551, https://doi.org/10.1007/BF01185481 . [all data]