O-Methyl-O-(2-bromo-1,1-difluoroethyl)ethanethionophosphonate

Normal alkane RI, non-polar column, custom temperature program

Data compiled by: NIST Mass Spectrometry Data Center, William E. Wallace, director

Column type Capillary
Active phase Polydimethyl siloxane
Column length (m)
Carrier gas
Substrate
Column diameter (mm)
Phase thickness (μm)
Program not specified
I 1249.
ReferenceSommer, Hartwig, et al., 1991
Comment MSDC-RI

References

Sommer, Hartwig, et al., 1991
Sommer, H.; Hartwig, J.; Homeyer, B.; Matthaer, H.-D., Pesticidal thionophosphonic acid(amide) esters, 1991, 21, retrieved from http://www.wikipatents.com/4985415.html. [all data]