O-Ethyl-O-isobutyl-S-(1,1-difluoro-3-ethylheptyl)-dithiophosphate

Normal alkane RI, non-polar column, custom temperature program

View large format table.

Column type Active phase I Reference Comment
CapillaryPolydimethyl siloxane1846.Sommer, Hartwig, et al., 1991Program: not specified

References

Sommer, Hartwig, et al., 1991
Sommer, H.; Hartwig, J.; Matthaei, H.-D., Pesticidal S-(Halogenoalkyl)-dithiophosphoric(phosphinoic) Acid Esters, 1991, 20. [all data]