1-Methyl-2-methoxyethyl heptanoate

Normal alkane RI, non-polar column, temperature ramp

Data compiled by: NIST Mass Spectrometry Data Center, William E. Wallace, director

Column type Capillary
Active phase Ultra-1
Column length (m) 25.
Carrier gas He
Substrate
Column diameter (mm) 0.32
Phase thickness (μm) 0.25
Tstart (C) 80.
Tend (C) 260.
Heat rate (K/min) 3.
Initial hold (min)
Final hold (min)
I 1307.
ReferenceOkumura, 1991
Comment MSDC-RI

References

Okumura, 1991
Okumura, T., retention indices of environmental chemicals on methyl silicone capillary column, Journal of Environmental Chemistry (Japan), 1991, 1, 2, 333-358, https://doi.org/10.5985/jec.1.333 . [all data]