Benzene, (1-ethyl-2-methylpropyl)

Normal alkane RI, polar column, temperature ramp

View large format table.

Column type Active phase I Reference Comment
CapillaryCarbowax 20M1367.Herain, MRAVEC, et al., 199170. C @ 21. min, 5. K/min, 150. C @ 999. min

References

Herain, MRAVEC, et al., 1991
Herain, J.; MRAVEC, D.; SCHNIERER, A., identification of the components of the reaction mixtures from transalkylation of the waste fraction of diisopropylbenzenes by capillary GC and GC-MS, Chem. Listy, 1991, 85, 5, 535-538. [all data]