5,17-Dimethylheneicosane

Normal alkane RI, non-polar column, temperature ramp

View large format table.

Column type Active phase I Reference Comment
CapillaryHP-12204.Haverty, Page, et al., 1991Helium, 3. K/min, 320. C @ 20. min; Column length: 30. m; Column diameter: 0.20 mm; Tstart: 150. C

References

Haverty, Page, et al., 1991
Haverty, M.I.; Page, M.; Thorne, B.L.; Escoubas, P., Cuticular hydrocarbons: species and population-level discrimination in termites, USDA Forest Service Gen. Tech. Report PSW-128, The Forest Service, U.S.Department of Agriculture, 1991, 52. [all data]