cis-Dihydrojasmonic acid, Ile conjugate, methyl ester, TMS

Van Den Dool and Kratz RI, non-polar column, custom temperature program

Data compiled by: NIST Mass Spectrometry Data Center, William E. Wallace, director

Column type Capillary
Active phase Ultra-1
Column length (m) 25.
Carrier gas
Substrate
Column diameter (mm) 0.20
Phase thickness (μm) 0.11
Program 60 0C (1 min) 30 0C/min -> 180 0C 10 0C/min -> 200 0C 5 0C/min -> 270 0C
I 2403.
ReferenceSchmidt, Kramell, et al., 1990
Comment MSDC-RI

References

Schmidt, Kramell, et al., 1990
Schmidt, J.; Kramell, R.; Brückner, C.; Schneider, G.; Sembdner, G.; Schreiber, K.; Stach, J.; Jensen, E., Gas chromatography/mass spectrometric and tandem mass spectrometric investigations of synthetic amino acid conjugates of jasmonic acid and endogenously occurring related compunds from Vicia faba L., Biomed. Environ. Mass Spectrom., 1990, 19, 5, 327-338, https://doi.org/10.1002/bms.1200190508 . [all data]