3,4-Dihydroxyphenylacetic acid, propionyl, DTFMBz

Normal alkane RI, non-polar column, temperature ramp

View large format table.

Column type Active phase I Reference Comment
CapillaryBP-12361.Midgley, Watson, et al., 1990Helium, 140. C @ 1. min, 10. K/min; Column length: 12. m; Column diameter: 0.25 mm; Tend: 300. C

References

Midgley, Watson, et al., 1990
Midgley, J.M.; Watson, D.G.; Macfarlane, R.G.; Macfarlane, S.C.; McGhee, C.N.J., Analysis of acidic metabolites of biogenic amines in bovine retina and vitreous and aqueous humour by gas chromatography-negative ion chemical ionisation mass spectrometry, J. Neurochemistry, 1990, 55, 3, 842-848, https://doi.org/10.1111/j.1471-4159.1990.tb04568.x . [all data]