Phenyl-(2-chlorophenyl)-imidazolyl carbinol

Normal alkane RI, non-polar column, custom temperature program

Data compiled by: NIST Mass Spectrometry Data Center, William E. Wallace, director

Column type Packed
Active phase OV-1
Column length (m) 1.2
Carrier gas Nitrogen
Substrate Chromosorb G (80-100 mesh)
Column diameter (mm)
Phase thickness (μm)
Program not specified
I 2239.
ReferenceJanos and Oros, 1990
Comment MSDC-RI

References

Janos and Oros, 1990
Janos, E.; Oros, G., Reversed-phase thin layer and gas chromatographic retention behaviour of triphenylmethane derivatives, J. Chromatogr., 1990, 520, 217-222, https://doi.org/10.1016/0021-9673(90)85105-5 . [all data]