Phenyl-(2,4-dichlorophenyl)carbinol

Normal alkane RI, non-polar column, custom temperature program

View large format table.

Column type Active phase I Reference Comment
PackedOV-12402.Janos and Oros, 1990Nitrogen, Chromosorb G (80-100 mesh); Column length: 1.2 m; Program: not specified

Normal alkane RI, polar column, custom temperature program

View large format table.

Column type Active phase I Reference Comment
PackedCarbowax 20M3325.Janos and Oros, 1990Nitrogen, Chromosorb G (80-100 mesh); Column length: 1.2 m; Program: not specified

References

Janos and Oros, 1990
Janos, E.; Oros, G., Reversed-phase thin layer and gas chromatographic retention behaviour of triphenylmethane derivatives, J. Chromatogr., 1990, 520, 217-222, https://doi.org/10.1016/0021-9673(90)85105-5 . [all data]