1,3,5(10)-Oestratriene-3,17β-diol, 3-non-deriv-17-HFB

Normal alkane RI, non-polar column, isothermal

View large format table.

Column type Active phase Temperature (C) I Reference Comment
CapillaryOV-73240.2856.Dehennin, 198925. m/0.32 mm/0.15 μm, H2

References

Dehennin, 1989
Dehennin, L., Mixed silyl ether-perfluoroacyl ester derivatives for gas chromatography/mass spectrometry of oestrogens. Application to the quantitative determination of oestriol in human plasma, Biomed. Environ. Mass Spectrom., 1989, 18, 5, 314-320, https://doi.org/10.1002/bms.1200180506 . [all data]