1,3,5(10)-Oestratriene-2-methoxy-3,16α,17β-triol, 3-non-deriv-16,17-PFP

Normal alkane RI, non-polar column, isothermal

Data compiled by: NIST Mass Spectrometry Data Center, William E. Wallace, director

Column type Capillary
Active phase OV-73
Column length (m) 25.
Carrier gas H2
Substrate
Column diameter (mm) 0.32
Phase thickness (μm) 0.15
Temperature (C) 240.
I 2544.
ReferenceDehennin, 1989
Comment MSDC-RI

References

Dehennin, 1989
Dehennin, L., Mixed silyl ether-perfluoroacyl ester derivatives for gas chromatography/mass spectrometry of oestrogens. Application to the quantitative determination of oestriol in human plasma, Biomed. Environ. Mass Spectrom., 1989, 18, 5, 314-320, https://doi.org/10.1002/bms.1200180506 . [all data]