Tripelenamine M (nor), acetylated

Normal alkane RI, non-polar column, temperature ramp

Data compiled by: NIST Mass Spectrometry Data Center, William E. Wallace, director

Column type Capillary
Active phase HP-1
Column length (m) 12.
Carrier gas He
Substrate
Column diameter (mm) 0.20
Phase thickness (μm) 0.33
Tstart (C) 100.
Tend (C) 310.
Heat rate (K/min) 30.
Initial hold (min) 3.
Final hold (min) 5.
I 2420.
ReferenceMaurer and Pfleger, 1988
Comment MSDC-RI

References

Maurer and Pfleger, 1988
Maurer, H.; Pfleger, K., Toxicological detection of ethylenediamine and piperazine antihistamines and their metabolites in urine by computerized gas chromatography-mass spectrometry, Fresenius Z. Anal. Chem., 1988, 331, 7, 744-756, https://doi.org/10.1007/BF01105612 . [all data]