3-Butenoic acid, 1-methylethyl ester

Kovats' RI, non-polar column, isothermal

View large format table.

Column type Active phase Temperature (C) I Reference Comment
PackedSE-30150.806.Ashes and Haken, 1975He, Celatom silanized (62-72 mesh); Column length: 3.7 m
PackedOV-1150.800.Ashes and Haken, 1971

References

Ashes and Haken, 1975
Ashes, J.R.; Haken, J.K., Gas chromatography of homologous esters. IX. Structure-retention increments of unsaturated esters, J. Chromatogr., 1975, 111, 1, 171-187, https://doi.org/10.1016/S0021-9673(01)80159-X . [all data]

Ashes and Haken, 1971
Ashes, J.R.; Haken, J.K., Gas chromatography of homologous esters. Part V. Retention of aliphatic esters on non-polar, donar and acceptor stationary phases, J. Chromatogr., 1971, 60, 33-44, https://doi.org/10.1016/S0021-9673(00)95527-4 . [all data]