Pro, propyl ester

Normal alkane RI, non-polar column, isothermal

View large format table.

Column type Active phase Temperature (C) I Reference Comment
CapillarySE-30130.1392.Lin, Lu, et al., 1988Column length: 27. m; Column diameter: 0.16 mm
CapillarySE-30135.1382.Lin, Lu, et al., 1988Column length: 27. m; Column diameter: 0.16 mm
CapillarySE-30140.1381.Lin, Lu, et al., 1988Column length: 27. m; Column diameter: 0.16 mm
CapillarySE-30145.1381.Lin, Lu, et al., 1988Column length: 27. m; Column diameter: 0.16 mm
CapillarySE-30150.1382.Lin, Lu, et al., 1988Column length: 27. m; Column diameter: 0.16 mm

References

Lin, Lu, et al., 1988
Lin, B.; Lu, P.; Koppenhofer, B., Chromatoghraphioc behavior of some amino acid derivatives on a chiral stationary phase and SE-20, Chin. J. Chromatogr., 1988, 6, 2, 69-73. [all data]