Pro, isopropyl ester

Normal alkane RI, non-polar column, isothermal

View large format table.

Column type Active phase Temperature (C) I Reference Comment
CapillarySE-30115.1344.Lin, Lu, et al., 1988Column length: 27. m; Column diameter: 0.16 mm
CapillarySE-30120.1336.Lin, Lu, et al., 1988Column length: 27. m; Column diameter: 0.16 mm
CapillarySE-30125.1340.Lin, Lu, et al., 1988Column length: 27. m; Column diameter: 0.16 mm
CapillarySE-30130.1330.Lin, Lu, et al., 1988Column length: 27. m; Column diameter: 0.16 mm
CapillarySE-30135.1330.Lin, Lu, et al., 1988Column length: 27. m; Column diameter: 0.16 mm

References

Lin, Lu, et al., 1988
Lin, B.; Lu, P.; Koppenhofer, B., Chromatoghraphioc behavior of some amino acid derivatives on a chiral stationary phase and SE-20, Chin. J. Chromatogr., 1988, 6, 2, 69-73. [all data]