5α-Cholanic acid, methyl ester

Normal alkane RI, non-polar column, isothermal

Data compiled by: NIST Mass Spectrometry Data Center, William E. Wallace, director

Column type Capillary
Active phase OV-1
Column length (m) 18.
Carrier gas He
Substrate
Column diameter (mm) 0.20
Phase thickness (μm) 0.25
Temperature (C) 270.
I 2941.
ReferenceLawson and Setchell, 1988
Comment MSDC-RI

References

Lawson and Setchell, 1988
Lawson, A.M.; Setchell, K.D.R., Appendix of GC retention indices. List of retention indices foe methyl ester - trimethylsilyl (Me-TMS) ether derivatives of bile acids, The Bile Acids. Vol. 4, Methods and Applications, 1988, 4, 571-575. [all data]