3β,7α-Dihydroxy-4-cholenic acid, methyl ester, TMS

Normal alkane RI, non-polar column, isothermal

View large format table.

Column type Active phase Temperature (C) I Reference Comment
CapillaryOV-1275.3200.Lawson and Setchell, 198818. m/0.20 mm/0.25 μm, He
CapillaryOV-1275.3204.Lawson and Setchell, 198818. m/0.20 mm/0.25 μm, He

References

Lawson and Setchell, 1988
Lawson, A.M.; Setchell, K.D.R., Appendix of GC retention indices. List of retention indices foe methyl ester - trimethylsilyl (Me-TMS) ether derivatives of bile acids, The Bile Acids. Vol. 4, Methods and Applications, 1988, 4, 571-575. [all data]