2-(2,2-Diethoxyethyl)imidazole

Normal alkane RI, non-polar column, temperature ramp

Data compiled by: NIST Mass Spectrometry Data Center, William E. Wallace, director

Column type Capillary
Active phase DB-5
Column length (m) 30.
Carrier gas Hydrogen
Substrate
Column diameter (mm) 0.35
Phase thickness (μm) 1.0
Tstart (C) 45.
Tend (C) 220.
Heat rate (K/min) 2.
Initial hold (min)
Final hold (min)
I 1199.
ReferenceGeorgilopoulos and Gallois, 1988
Comment MSDC-RI

References

Georgilopoulos and Gallois, 1988
Georgilopoulos, D.N.; Gallois, A.N., Flavour compounds of a commercial concentrated blackberry juice, Food Chem., 1988, 28, 2, 141-148, https://doi.org/10.1016/0308-8146(88)90143-4 . [all data]