Cholanic acid, 7β-hydroxy, Me-DMES

Normal alkane RI, non-polar column, custom temperature program

Data compiled by: NIST Mass Spectrometry Data Center, William E. Wallace, director

Column type Capillary
Active phase OV-1
Column length (m) 18.
Carrier gas He
Substrate
Column diameter (mm) 0.20
Phase thickness (μm) 0.25
Program not specified
I 3188.
ReferenceIida, Momose, et al., 1987
Comment MSDC-RI

Normal alkane RI, polar column, custom temperature program

View large format table.

Column type Active phase I Reference Comment
CapillaryDB-Wax3714.Iida, Momose, et al., 198715. m/0.25 mm/0.25 μm, He; Program: not specified

References

Iida, Momose, et al., 1987
Iida, T.; Momose, T.; Tamura, T.; Matsumoto, T.; Goto, J.; Nambara, T.; Chang, F.C., Capillary gas chromatography of hydroxylated bile acid stereoisomers of the allo and normal series, J. Chromatogr., 1987, 389, 155-164, https://doi.org/10.1016/S0021-9673(01)94419-X . [all data]