allo-Cholanic acid, 3α,7α,12β-trihydroxy, Me-TMS

Normal alkane RI, non-polar column, custom temperature program

Data compiled by: NIST Mass Spectrometry Data Center, William E. Wallace, director

Column type Capillary
Active phase OV-1
Column length (m) 18.
Carrier gas He
Substrate
Column diameter (mm) 0.20
Phase thickness (μm) 0.25
Program not specified
I 3211.
ReferenceIida, Momose, et al., 1987
Comment MSDC-RI

References

Iida, Momose, et al., 1987
Iida, T.; Momose, T.; Tamura, T.; Matsumoto, T.; Goto, J.; Nambara, T.; Chang, F.C., Capillary gas chromatography of hydroxylated bile acid stereoisomers of the allo and normal series, J. Chromatogr., 1987, 389, 155-164, https://doi.org/10.1016/S0021-9673(01)94419-X . [all data]