2-Cyclopenten-1-one, 2-hydroxy-3,4,5-trimethyl, cis

Van Den Dool and Kratz RI, non-polar column, temperature ramp

View large format table.

Column type Active phase I Reference Comment
CapillaryOV-1011138.Mihara and Nishimura, 1989N2, 2. K/min; Column length: 50. m; Column diameter: 0.22 mm; Tstart: 80. C; Tend: 200. C

Van Den Dool and Kratz RI, polar column, temperature ramp

View large format table.

Column type Active phase I Reference Comment
CapillaryCarbowax 20M1826.Mihara and Nishimura, 1989N2, 2. K/min; Column length: 50. m; Column diameter: 0.22 mm; Tstart: 80. C; Tend: 200. C

Normal alkane RI, non-polar column, temperature ramp

View large format table.

Column type Active phase I Reference Comment
CapillaryOV-1011138.Nishimura and Mihara, 1990N2, 2. K/min; Column length: 50. m; Column diameter: 0.23 mm; Tstart: 80. C; Tend: 200. C

Normal alkane RI, polar column, temperature ramp

View large format table.

Column type Active phase I Reference Comment
CapillaryCarbowax 20M1826.Nishimura and Mihara, 1990N2, 2. K/min; Column length: 50. m; Column diameter: 0.23 mm; Tstart: 80. C; Tend: 200. C

References

Mihara and Nishimura, 1989
Mihara, S.; Nishimura, O., Retention indices of 2-hydroxy-2-cyclopenten-1-ones, J. Hi. Res. Chromatogr., 1989, 12, 11, 763-764, https://doi.org/10.1002/jhrc.1240121116 . [all data]

Nishimura and Mihara, 1990
Nishimura, O.; Mihara, S., Investigation of 2-hydroxy-2-cyclopenten-1-ones in roasted coffee, J. Agric. Food Chem., 1990, 38, 4, 1038-1041, https://doi.org/10.1021/jf00094a027 . [all data]