2-Acetyl-5-methylpyridine

Normal alkane RI, polar column, custom temperature program

Data compiled by: NIST Mass Spectrometry Data Center, William E. Wallace, director

Column type CapillaryCapillaryCapillaryCapillaryCapillary
Active phase CarbowaxCarbowaxCarbowaxCarbowaxCarbowax
Column length (m)
Carrier gas
Substrate
Column diameter (mm)
Phase thickness (μm)
Program not specifiednot specifiednot specifiednot specifiednot specified
I 1715.1716.1716.1717.1719.
ReferenceBaltes and Bochmann, 1987Baltes and Bochmann, 1987Baltes and Bochmann, 1987Baltes and Bochmann, 1987Baltes and Bochmann, 1987
Comment MSDC-RI MSDC-RI MSDC-RI MSDC-RI MSDC-RI

References

Baltes and Bochmann, 1987
Baltes, W.; Bochmann, G., Model reactions on roast aroma formations, V. Mass spectrometric identification of pyrifines, oxazoles, and carbocyclic compounds from the reaction of serine and threonine with sucrose under the conditions of coffee roasting, Z. Lebensm. Unters. Forsch., 1987, 185, 1, 5-9, https://doi.org/10.1007/BF01083331 . [all data]