L(+)-Bornesitol, TMS

Normal alkane RI, non-polar column, custom temperature program

View large format table.

Column type Active phase I Reference Comment
CapillaryOV-1012043.Binder and Haddon, 1984Helium; Column length: 42. m; Column diameter: 0.50 mm; Program: 60 0C (0.5 min) 30 0C/min -> 170 0C 3 0C/min -> 220 0C
CapillaryOV-1012047.Binder and Haddon, 1984Helium; Column length: 42. m; Column diameter: 0.50 mm; Program: 80 0C (0.5 min) 30 0C/min -> 170 0C 3 0C/min -> 220 0C

References

Binder and Haddon, 1984
Binder, R.B.; Haddon, W.F., Analysis of O-methylinositols by gas-liquid chromatography-mass spectrometry, Carbohydrate Research, 1984, 129, 21-32, https://doi.org/10.1016/0008-6215(84)85295-7 . [all data]