Dicyclopentadiene, 3,8-dimethyl

Normal alkane RI, non-polar column, isothermal

View large format table.

Column type Active phase Temperature (C) I Reference Comment
CapillarySqualane104.1142.Bermejo, Blanco, et al., 1983N2; Column length: 50. m; Column diameter: 0.25 mm

References

Bermejo, Blanco, et al., 1983
Bermejo, J.; Blanco, C.G.; Diez, M.A.; Suarez Canga, J., Identification of methyl and dimethyl derivatives of dicyclopentadiene, AFINIDAD, 1983, 40, 386, 320-326. [all data]