trans,cis,trans-Bicyclo[4.4.0]decane, 2,5-dimethyl

Normal alkane RI, non-polar column, isothermal

Data compiled by: NIST Mass Spectrometry Data Center, William E. Wallace, director

Column type Capillary
Active phase Squalane
Column length (m) 50.
Carrier gas He
Substrate
Column diameter (mm) 0.25
Phase thickness (μm)
Temperature (C) 120.
I 1240.
ReferenceRang, Kurashova, et al., 1982
Comment MSDC-RI

References

Rang, Kurashova, et al., 1982
Rang, S.; Kurashova, E.Kh.; Musaev, I.A.; Strenze, T.V.; Joepera, E.; Eisen, O.; Sanin, P.I., Gas-chromatographic characteristics of stereoisomers of the bicyblo[4.4.0]decane series, Neftekhimiya, 1982, 22, 3, 303-308. [all data]