2-Deoxyribose, MO-TMS

Normal alkane RI, non-polar column, isothermal

Data compiled by: NIST Mass Spectrometry Data Center, William E. Wallace, director

Column type CapillaryCapillary
Active phase OV-101SE-30
Column length (m) 50.
Carrier gas  35
Substrate
Column diameter (mm) 0.300.30
Phase thickness (μm)
Temperature (C) 175.165.
I 1570.1570.
ReferenceZegota, 1980Zegota, 1980
Comment MSDC-RI MSDC-RI

References

Zegota, 1980
Zegota, H., Separation and quantitative determination of fructose as the O-methyloxime by gas-liquid chromatography using glass capillary columns, J. Chromatogr., 1980, 192, 2, 446-451, https://doi.org/10.1016/S0021-9673(80)80024-0 . [all data]